Target
Cathepsin D
Ligand
BDBM50210711
Substrate
Meas. Tech.
ChEMBL_438638 (CHEMBL888969)
IC50
>20000±n/a nM
Citation
 Kortum, SWBenson, TEBienkowski, MJEmmons, TLPrince, DBPaddock, DJTomasselli, AGMoon, JBLaBorde, ATenBrink, RE Potent and selective isophthalamide S2 hydroxyethylamine inhibitors of BACE1. Bioorg Med Chem Lett 17:3378-83 (2007)  
Target
Name:
Cathepsin D
Synonyms:
CATD_HUMAN CTSD Cathepsin D heavy chain Cathepsin D precursor
Type:
Enzyme
Mol. Mass.:
44551.72
Organism:
Homo sapiens (Human)
Description:
Human proCathepsin D (SwissProt accession number P07339) was expressed in Sf9 cells, purified, and autoactivated.
Residue:
412
  
Inhibitor
Name:
BDBM50210711
Synonyms:
CHEMBL230314 | N1-((2S,3R)-4-(3-methoxybenzylamino)-3-hydroxy-1-phenylbutan-2-yl)-5-cyano-N3-propylisophthalamide
Type:
Small organic molecule
Emp. Form.:
C30H34N4O4
Mol. Mass.:
514.6154
SMILES:
CCCNC(=O)c1cc(cc(c1)C(=O)N[C@@H](Cc1ccccc1)[C@H](O)CNCc1cccc(OC)c1)C#N
: