Target
Melanocortin receptor 3
Ligand
BDBM50211369
Substrate
Meas. Tech.
ChEMBL_434964 (CHEMBL919365)
IC50
>10000±n/a nM
Citation
 Bednarek, MAMacNeil, TTang, RFong, TMCabello, MAMaroto, MTeran, A Potent and selective agonists of human melanocortin receptor 5: cyclic analogues of alpha-melanocyte-stimulating hormone. J Med Chem 50:2520-6 (2007)  
Target
Name:
Melanocortin receptor 3
Synonyms:
MC3-R MC3R_HUMAN Melanocortin receptor (M3 and M4)
Type:
Enzyme
Mol. Mass.:
36044.86
Organism:
Homo sapiens (Human)
Description:
P41968
Residue:
323
  
Inhibitor
Name:
BDBM50211369
Synonyms:
Ac-Nle4-cyclo(Asp5-Val6-D-4,4'-Bip7-Pip8-Trp9-Lys10)-NH2 | CHEMBL2371969
Type:
Small organic molecule
Emp. Form.:
C55H72N10O9
Mol. Mass.:
1017.2218
SMILES:
[H][C@@]12CCCCN1C(=O)[C@H](Cc1ccc(cc1)-c1ccccc1)NC(=O)[C@@H](NC(=O)[C@H](CC(=O)NCCCC[C@H](NC(=O)[C@H](Cc1c[nH]c3ccccc13)NC2=O)C(N)=O)NC(=O)[C@H](CCCC)NC(C)=O)C(C)C
: