Target
Glutamate receptor 3
Ligand
BDBM50002370
Substrate
Meas. Tech.
ChEMBL_435004 (CHEMBL920255)
Ki
0.021±n/a nM
Citation
 Vogensen, SBFrydenvang, KGreenwood, JRPostorino, GNielsen, BPickering, DSEbert, BBølcho, UEgebjerg, JGajhede, MKastrup, JSJohansen, TNClausen, RPKrogsgaard-Larsen, P A tetrazolyl-substituted subtype-selective AMPA receptor agonist. J Med Chem 50:2408-14 (2007)  
Target
Name:
Glutamate receptor 3
Synonyms:
GRIA3_RAT Glutamate receptor 3 Glutamate-AMPA | Gria3
Type:
Enzyme Catalytic Domain
Mol. Mass.:
100383.57
Organism:
RAT
Description:
Glutamate-AMPA GRIA3 RAT::P19492
Residue:
888
  
Inhibitor
Name:
BDBM50002370
Synonyms:
(R,S)-alpha-amino-3-hydroxy-5-methyl-4-isooxazole-propionic acid 2-Amino-3-(3-hydroxy-5-methyl-isoxazol-4-yl)-propionic acid 2-amino-3-(3-hydroxy-5-methyl-4-isoxazolyl)-propionic acid 2-ammonio-3-(3-hydroxy-5-methylisoxazol-4-yl)propanoate CHEMBL13378
Type:
Small organic molecule
Emp. Form.:
C7H10N2O4
Mol. Mass.:
186.1653
SMILES:
Cc1o[nH]c(=O)c1CC(N)C(O)=O
: