Target
B1 bradykinin receptor
Ligand
BDBM50212094
Substrate
Meas. Tech.
ChEMBL_447237 (CHEMBL897541)
Ki
0.46±n/a nM
Citation
 Kuduk, SDDiPardo, RMChang, RKDi Marco, CNMurphy, KLRansom, RWReiss, DRTang, CPrueksaritanont, TPettibone, DJBock, MG Bradykinin B1 antagonists: biphenyl SAR studies in the cyclopropanecarboxamide series. Bioorg Med Chem Lett 17:3608-12 (2007)  
Target
Name:
B1 bradykinin receptor
Synonyms:
B1 BRADYKININ B1R BK-1 receptor BRADYB1 | Bradykinin B1 receptor
Type:
Enzyme
Mol. Mass.:
40508.87
Organism:
Homo sapiens (Human)
Description:
P46663
Residue:
353
  
Inhibitor
Name:
BDBM50212094
Synonyms:
3,5-dichloro-3'-fluoro-4'-((R)-1-{[1-(2,2,2-trifluoro-acetylamino)-cyclopropanecarbonyl]-amino}-ethyl)-biphenyl-2-carboxylic acid methyl ester | CHEMBL233968
Type:
Small organic molecule
Emp. Form.:
C22H18Cl2F4N2O4
Mol. Mass.:
521.289
SMILES:
COC(=O)c1c(Cl)cc(Cl)cc1-c1ccc([C@@H](C)NC(=O)C2(CC2)NC(=O)C(F)(F)F)c(F)c1
: