Target
Steroid hormone receptor ERR1
Ligand
BDBM50212166
Substrate
Meas. Tech.
ChEMBL_455655 (CHEMBL886438)
IC50
3.3±n/a nM
Citation
 Vu, ATCampbell, ANHarris, HAUnwalla, RJManas, ESMewshaw, RE ERbeta ligands. Part 6: 6H-Chromeno[4,3-b]quinolines as a new series of estrogen receptor beta-selective ligands. Bioorg Med Chem Lett 17:4053-6 (2007)  
Target
Name:
Steroid hormone receptor ERR1
Synonyms:
ERR-alpha ERR1_HUMAN ESRRA Estrogen-Related Receptor, alpha NR3B1 Steroid hormone receptor ERR1 Steroid hormone receptor ERR1/Estrogen-related receptor alpha (ERRa) | von Hippel-Lindau disease tumor suppressor/Steroid hormone receptor ERR1
Type:
PROTEIN
Mol. Mass.:
45508.08
Organism:
Homo sapiens (Human)
Description:
ChEMBL_1499891
Residue:
423
  
Inhibitor
Name:
BDBM50212166
Synonyms:
7-chloro-6H-chromeno[4,3-b]quinoline-3,9-diol | CHEMBL402491
Type:
Small organic molecule
Emp. Form.:
C16H10ClNO3
Mol. Mass.:
299.708
SMILES:
Oc1ccc-2c(OCc3c(Cl)c4cc(O)ccc4nc-23)c1
: