Target
Retinoic acid receptor RXR-alpha
Ligand
BDBM50212274
Substrate
Meas. Tech.
ChEMBL_455695 (CHEMBL886478)
EC50
0.9±n/a nM
Citation
 Lagu, BPio, BLebedev, RYang, MPelton, PD RXR-LXR heterodimer modulators for the potential treatment of dyslipidemia. Bioorg Med Chem Lett 17:3497-503 (2007)  
Target
Name:
Retinoic acid receptor RXR-alpha
Synonyms:
NR2B1 Nuclear receptor subfamily 4 group A member 2 RXRA Retinoic acid receptor RXR-alpha/gamma Retinoid receptor
Type:
PROTEIN
Mol. Mass.:
50820.38
Organism:
Homo sapiens (Human)
Description:
ChEMBL_1456363
Residue:
462
  
Inhibitor
Name:
BDBM50212274
Synonyms:
5-((3-(1-ethyl-4,4,6-trimethyl-2-oxo-1,2,3,4-tetrahydroquinolin-7-yl)-4-(trifluoromethoxy)phenyl)methylene)thiazolidine-2,4-dione | CHEMBL248415
Type:
Small organic molecule
Emp. Form.:
C25H23F3N2O4S
Mol. Mass.:
504.521
SMILES:
CCN1C(=O)CC(C)(C)c2cc(C)c(cc12)-c1cc(C=C2SC(O)=NC2=O)ccc1OC(F)(F)F
: