Target
Retinoic acid receptor RXR-alpha
Ligand
BDBM50212277
Substrate
Meas. Tech.
ChEMBL_455725 (CHEMBL887724)
EC50
1.8±n/a nM
Citation
 Lagu, BLebedev, RPio, BYang, MPelton, PD Dihydro-[1H]-quinolin-2-ones as retinoid X receptor (RXR) agonists for potential treatment of dyslipidemia. Bioorg Med Chem Lett 17:3491-6 (2007)  
Target
Name:
Retinoic acid receptor RXR-alpha
Synonyms:
NR2B1 Nuclear receptor subfamily 4 group A member 2 RXRA Retinoic acid receptor RXR-alpha/gamma Retinoid receptor
Type:
PROTEIN
Mol. Mass.:
50820.38
Organism:
Homo sapiens (Human)
Description:
ChEMBL_1456363
Residue:
462
  
Inhibitor
Name:
BDBM50212277
Synonyms:
(E)-3-(3-(1-ethyl-4,4,6-trimethyl-2-oxo-1,2,3,4-tetrahydroquinolin-7-yl)-4-(trifluoromethoxy)phenyl)acrylic acid CHEMBL246821
Type:
Small organic molecule
Emp. Form.:
C24H24F3NO4
Mol. Mass.:
447.4469
SMILES:
CCN1C(=O)CC(C)(C)c2cc(C)c(cc12)-c1cc(\C=C\C(O)=O)ccc1OC(F)(F)F
: