Target
Fatty acid-binding protein, heart
Ligand
BDBM50212872
Substrate
Meas. Tech.
ChEMBL_455934 (CHEMBL887935)
Ki
>1000±n/a nM
Citation
 Sulsky, RMagnin, DRHuang, YSimpkins, LTaunk, PPatel, MZhu, YStouch, TRBassolino-Klimas, DParker, RHarrity, TStoffel, RTaylor, DSLavoie, TBKish, KJacobson, BLSheriff, SAdam, LPEwing, WRRobl, JA Potent and selective biphenyl azole inhibitors of adipocyte fatty acid binding protein (aFABP). Bioorg Med Chem Lett 17:3511-5 (2007)  
Target
Name:
Fatty acid-binding protein, heart
Synonyms:
FABP11 FABPH_HUMAN MDGI
Type:
PROTEIN
Mol. Mass.:
14858.36
Organism:
Homo sapiens (Human)
Description:
ChEMBL_1463784
Residue:
133
  
Inhibitor
Name:
BDBM50212872
Synonyms:
CHEMBL246062 | [2'-(1-carboxymethyl-4,5-diphenyl-1H-imidazol-2-yl)-biphenyl-3-ylamino]-acetic acid
Type:
Small organic molecule
Emp. Form.:
C31H25N3O4
Mol. Mass.:
503.5479
SMILES:
OC(=O)CNc1cccc(c1)-c1ccccc1-c1nc(c(-c2ccccc2)n1CC(O)=O)-c1ccccc1
: