Target
Dipeptidyl peptidase 2
Ligand
BDBM50212928
Substrate
Meas. Tech.
ChEMBL_447408 (CHEMBL896432)
IC50
61000±n/a nM
Citation
 Gao, YDFeng, DSheridan, RPScapin, GPatel, SBWu, JKZhang, XSinha-Roy, RThornberry, NAWeber, AEBiftu, T Modeling assisted rational design of novel, potent, and selective pyrrolopyrimidine DPP-4 inhibitors. Bioorg Med Chem Lett 17:3877-9 (2007)  
Target
Name:
Dipeptidyl peptidase 2
Synonyms:
DAP II DPP2_HUMAN Dipeptidyl aminopeptidase II Dipeptidyl peptidase 2 (DPP2) Dipeptidyl peptidase II (DPP II) Dipeptidyl peptidase II and dipeptidyl peptidase IV (DPP2 and DPP4) carboxytripeptidase dipeptidyl(amino)peptidase II | dipeptidylarylamidase
Type:
Protein
Mol. Mass.:
54339.29
Organism:
Homo sapiens (Human)
Description:
Q9UHL4
Residue:
492
  
Inhibitor
Name:
BDBM50212928
Synonyms:
(1S,2R,5S)-5-(2-cyclopropyl-5H-pyrrolo[3,4-d]pyrimidin-6(7H)-yl)-2-(2,4,5-trifluorophenyl)cyclohexanamine | CHEMBL233563
Type:
Small organic molecule
Emp. Form.:
C21H23F3N4
Mol. Mass.:
388.4293
SMILES:
N[C@H]1C[C@H](CC[C@@H]1c1cc(F)c(F)cc1F)N1Cc2cnc(nc2C1)C1CC1
: