Target
D(2) dopamine receptor
Ligand
BDBM50213512
Substrate
Meas. Tech.
ChEMBL_438895 (CHEMBL889238)
Ki
129±n/a nM
Citation
 Chiu, GLi, SConnolly, PJPulito, VLiu, JMiddleton, SA (Phenylpiperidinyl)cyclohexylsulfonamides: development of alpha1a/1d-selective adrenergic receptor antagonists for the treatment of benign prostatic hyperplasia/lower urinary tract symptoms (BPH/LUTS). Bioorg Med Chem Lett 17:3930-4 (2007)  
Target
Name:
D(2) dopamine receptor
Synonyms:
D(2) dopamine receptor DOPAMINE D2 Long DRD2 Dopamine D2 receptor Dopamine D2 receptor (D2R) Dopamine2-like | d2
Type:
Cell-surface receptors
Mol. Mass.:
50647.10
Organism:
Homo sapiens (Human)
Description:
P14416
Residue:
443
  
Inhibitor
Name:
BDBM50213512
Synonyms:
5-chloro-N-((1s,4s)-4-(4-(2-cyclopropoxyphenyl)piperidin-1-yl)cyclohexyl)-2-methoxybenzenesulfonamide | CHEMBL388897
Type:
Small organic molecule
Emp. Form.:
C27H35ClN2O4S
Mol. Mass.:
519.096
SMILES:
COc1ccc(Cl)cc1S(=O)(=O)N[C@H]1CC[C@H](CC1)N1CCC(CC1)c1ccccc1OC1CC1
: