Target
Cannabinoid receptor 1
Ligand
BDBM50213617
Substrate
Meas. Tech.
ChEMBL_456162 (CHEMBL888172)
IC50
>5000±n/a nM
Citation
 Kai, HMorioka, YMurashi, TMorita, KShinonome, SNakazato, HKawamoto, KHanasaki, KTakahashi, FMihara, SArai, TAbe, KOkabe, HBaba, TYoshikawa, TTakenaka, H 2-Arylimino-5,6-dihydro-4H-1,3-thiazines as a new class of cannabinoid receptor agonists. Part 1: discovery of CB2 receptor selective compounds. Bioorg Med Chem Lett 17:4030-4 (2007)  
Target
Name:
Cannabinoid receptor 1
Synonyms:
CANN6 CB-R CNR CNR1_HUMAN Cannabinoid receptor Cannabinoid receptor 1 (brain)
Type:
G Protein-Coupled Receptor (GPCR)
Mol. Mass.:
52868.96
Organism:
Homo sapiens (Human)
Description:
P21554
Residue:
472
  
Inhibitor
Name:
BDBM50213617
Synonyms:
(Z)-methyl 2-(2-isopropylphenylimino)-5,5-dimethyl-1,3-thiazinane-3-carbodithioate | CHEMBL232730
Type:
Small organic molecule
Emp. Form.:
C17H24N2S3
Mol. Mass.:
352.581
SMILES:
CSC(=S)N1CC(C)(C)CS\C1=N/c1ccccc1C(C)C
: