Target
Cannabinoid receptor 2
Ligand
BDBM50213647
Substrate
Meas. Tech.
ChEMBL_456157 (CHEMBL888169)
Ki
119±n/a nM
Citation
 Kai, HMorioka, YMurashi, TMorita, KShinonome, SNakazato, HKawamoto, KHanasaki, KTakahashi, FMihara, SArai, TAbe, KOkabe, HBaba, TYoshikawa, TTakenaka, H 2-Arylimino-5,6-dihydro-4H-1,3-thiazines as a new class of cannabinoid receptor agonists. Part 1: discovery of CB2 receptor selective compounds. Bioorg Med Chem Lett 17:4030-4 (2007)  
Target
Name:
Cannabinoid receptor 2
Synonyms:
CANNABINOID CB2 CB2 CB2B CNR2_HUMAN Cannabinoid CB2 receptor Cannabinoid receptor 2 (CB2R) | hCB2
Type:
G Protein-Coupled Receptor (GPCR)
Mol. Mass.:
39690.94
Organism:
Homo sapiens (Human)
Description:
P34972
Residue:
360
  
Inhibitor
Name:
BDBM50213647
Synonyms:
(Z)-propyl 2-(2-isopropylphenylimino)-5,5-dimethyl-1,3-thiazinane-3-carbodithioate | CHEMBL248341
Type:
Small organic molecule
Emp. Form.:
C19H28N2S3
Mol. Mass.:
380.634
SMILES:
CCCSC(=S)N1CC(C)(C)CS\C1=N/c1ccccc1C(C)C
: