Target
Gonadotropin-releasing hormone receptor
Ligand
BDBM50213651
Substrate
Meas. Tech.
ChEMBL_447479 (CHEMBL896502)
Ki
1600±n/a nM
Citation
 Chen, MGuo, ZLanier, MCZhao, LBetz, SFHuang, CQLoweth, CJAshweek, NJLiu, XJStruthers, RSBradbury, MJBehan, JWWen, JO'Brien, ZSaunders, JZhu, YF Identification of 2-(4,5,6,7-tetrahydro-1H-pyrrolo[3,2-c]pyridin-3-yl)-ethylamine derivatives as novel GnRH receptor antagonists. Bioorg Med Chem Lett 17:3845-50 (2007)  
Target
Name:
Gonadotropin-releasing hormone receptor
Synonyms:
GNRHR_RAT GnRH-R | Gnrhr
Type:
PROTEIN
Mol. Mass.:
37767.60
Organism:
Rattus norvegicus
Description:
ChEMBL_1335047
Residue:
327
  
Inhibitor
Name:
BDBM50213651
Synonyms:
(S)-1-(3-(1-(4-(1H-tetrazol-5-yl)benzylamino)propan-2-yl)-2-(3,5-dimethylphenyl)-6,7-dihydro-1H-pyrrolo[3,2-c]pyridin-5(4H)-yl)-2-(2-fluoro-6-(trifluoromethyl)phenyl)ethanone | CHEMBL409825
Type:
Small organic molecule
Emp. Form.:
C35H35F4N7O
Mol. Mass.:
645.6923
SMILES:
C[C@H](CNCc1ccc(cc1)-c1nnn[nH]1)c1c2CN(CCc2[nH]c1-c1cc(C)cc(C)c1)C(=O)Cc1c(F)cccc1C(F)(F)F
: