Target
Cannabinoid receptor 2
Ligand
BDBM50213894
Substrate
Meas. Tech.
ChEMBL_447525 (CHEMBL895424)
Ki
65±n/a nM
Citation
 Kai, HMorioka, YTomida, MTakahashi, THattori, MHanasaki, KKoike, KChiba, HShinohara, SKanemasa, TIwamoto, YTakahashi, KYamaguchi, YBaba, TYoshikawa, TTakenaka, H 2-Arylimino-5,6-dihydro-4H-1,3-thiazines as a new class of cannabinoid receptor agonists. Part 2: orally bioavailable compounds. Bioorg Med Chem Lett 17:3925-9 (2007)  
Target
Name:
Cannabinoid receptor 2
Synonyms:
CANNABINOID CB2 CB2 CB2B CNR2_HUMAN Cannabinoid CB2 receptor Cannabinoid receptor 2 (CB2R) | hCB2
Type:
G Protein-Coupled Receptor (GPCR)
Mol. Mass.:
39690.94
Organism:
Homo sapiens (Human)
Description:
P34972
Residue:
360
  
Inhibitor
Name:
BDBM50213894
Synonyms:
6-[(Z)-2-isopropyl-phenylimino]-5-thia-7-aza-spiro[2.5]octane-7-carbodithioic acid methyl ester | CHEMBL232928
Type:
Small organic molecule
Emp. Form.:
C17H22N2S3
Mol. Mass.:
350.565
SMILES:
CSC(=S)N1CC2(CC2)CS\C1=N/c1ccccc1C(C)C
: