Target
Transcription factor Jun
Ligand
BDBM50213936
Substrate
Meas. Tech.
ChEMBL_456206 (CHEMBL888216)
IC50
>300±n/a nM
Citation
 Gao, WBussom, SGrill, SPGullen, EAHu, YCHuang, XZhong, SKaczmarek, CGutierrez, JFrancis, SBaker, DCYu, SCheng, YC Structure-activity studies of phenanthroindolizidine alkaloids as potential antitumor agents. Bioorg Med Chem Lett 17:4338-42 (2007)  
Target
Name:
Transcription factor Jun
Synonyms:
AP1 JUN Proto-oncogene c-JUN Transcription factor AP1 p39
Type:
Mol. Mass.:
35683.24
Organism:
Homo sapiens (Human)
Description:
P05412
Residue:
331
  
Inhibitor
Name:
BDBM50213936
Synonyms:
(S)-2,3,6,7-tetramethoxy-8b,9,10,11,12,12a-hexahydro-9a-aza-cyclopenta[b]triphenylene | CHEMBL399317
Type:
Small organic molecule
Emp. Form.:
C24H27NO4
Mol. Mass.:
393.4755
SMILES:
COc1cc2C3CN4CCC[C@H]4C=C3c3cc(OC)c(OC)cc3-c2cc1OC
: