Target
Transcription factor Jun
Ligand
BDBM50213934
Substrate
Meas. Tech.
ChEMBL_456206 (CHEMBL888216)
IC50
110±n/a nM
Citation
 Gao, WBussom, SGrill, SPGullen, EAHu, YCHuang, XZhong, SKaczmarek, CGutierrez, JFrancis, SBaker, DCYu, SCheng, YC Structure-activity studies of phenanthroindolizidine alkaloids as potential antitumor agents. Bioorg Med Chem Lett 17:4338-42 (2007)  
Target
Name:
Transcription factor Jun
Synonyms:
AP1 JUN Proto-oncogene c-JUN Transcription factor AP1 p39
Type:
Mol. Mass.:
35683.24
Organism:
Homo sapiens (Human)
Description:
P05412
Residue:
331
  
Inhibitor
Name:
BDBM50213934
Synonyms:
CHEMBL398325 | tylophorinine
Type:
Small organic molecule
Emp. Form.:
C23H25NO4
Mol. Mass.:
379.4489
SMILES:
COc1ccc2c3[C@@H](O)[C@@H]4CCCN4Cc3c3cc(OC)c(OC)cc3c2c1
: