Target
Metabotropic glutamate receptor 5
Ligand
BDBM50214072
Substrate
Meas. Tech.
ChEMBL_456242 (CHEMBL888252)
IC50
>100000±n/a nM
Citation
 Wang, XKolasa, TEl Kouhen, OFChovan, LEBlack-Shaefer, CLWagenaar, FLGarton, JAMoreland, RBHonore, PLau, YYDandliker, PJBrioni, JDStewart, AO Rapid hit to lead evaluation of pyrazolo[3,4-d]pyrimidin-4-one as selective and orally bioavailable mGluR1 antagonists. Bioorg Med Chem Lett 17:4303-7 (2007)  
Target
Name:
Metabotropic glutamate receptor 5
Synonyms:
GPRC1E GRM5_HUMAN metabotropic glutamate 5 | metabotropic glutamate 5a
Type:
Enzyme
Mol. Mass.:
132484.72
Organism:
Homo sapiens (Human)
Description:
Residue:
1212
  
Inhibitor
Name:
BDBM50214072
Synonyms:
5-(4-chlorophenyl)-1-(cyclohexylmethyl)-6-methyl-1H-pyrazolo[3,4-d]pyrimidin-4(5H)-one | CHEMBL246610
Type:
Small organic molecule
Emp. Form.:
C19H21ClN4O
Mol. Mass.:
356.849
SMILES:
Cc1nc2n(CC3CCCCC3)ncc2c(=O)n1-c1ccc(Cl)cc1
: