Target
Adenosine receptor A2a
Ligand
BDBM50214402
Substrate
Meas. Tech.
ChEMBL_439030 (CHEMBL889376)
Kd
50000±n/a nM
Citation
 Vendrell, MAngulo, ECasadó, VLluis, CFranco, RAlbericio, FRoyo, M Novel ergopeptides as dual ligands for adenosine and dopamine receptors. J Med Chem 50:3062-9 (2007)  
Target
Name:
Adenosine receptor A2a
Synonyms:
A2A adenosine receptor (hA2A) ADENOSINE A2 ADORA2 Adenosine A2A receptor (A2AAR)
Type:
G Protein-Coupled Receptor (GPCR)
Mol. Mass.:
44716.46
Organism:
Homo sapiens (Human)
Description:
P29274
Residue:
412
  
Inhibitor
Name:
BDBM50214402
Synonyms:
(6aR,9R)-N-((S)-1-((S)-1-(3-carbamoylpiperidin-1-yl)-4-cyclohexyl-1-oxobutan-2-ylamino)-3-methyl-1-oxobutan-2-yl)-7-methyl-4,6,6a,7,8,9-hexahydroindolo[4,3-fg]quinoline-9-carboxamide | CHEMBL390298
Type:
Small organic molecule
Emp. Form.:
C37H52N6O4
Mol. Mass.:
644.8466
SMILES:
CC(C)[C@H](NC(=O)[C@H]1CN(C)[C@@H]2Cc3c[nH]c4cccc(C2=C1)c34)C(=O)N[C@@H](CCC1CCCCC1)C(=O)N1CCCC(C1)C(N)=O
: