Target
TGF-beta receptor type-1
Ligand
BDBM50214865
Substrate
Meas. Tech.
ChEMBL_439212 (CHEMBL889560)
IC50
75±n/a nM
Citation
 Kim, DKJang, YLee, HSPark, HJYoo, J Synthesis and biological evaluation of 4(5)-(6-alkylpyridin-2-yl)imidazoles as transforming growth factor-beta type 1 receptor kinase inhibitors. J Med Chem 50:3143-7 (2007)  
Target
Name:
TGF-beta receptor type-1
Synonyms:
ALK-5 Activin A receptor type II-like protein kinase of 53kD SKR4 TGF-beta receptor type I TGFBR1 TGFR1_HUMAN Transforming growth factor-beta receptor type I
Type:
enzyme
Mol. Mass.:
55968.24
Organism:
Homo sapiens (Human)
Description:
P36897
Residue:
503
  
Inhibitor
Name:
BDBM50214865
Synonyms:
4-((5-(6-methylpyridin-2-yl)-4-(quinoxalin-6-yl)-1H-imidazol-2-yl)methylamino)benzamide | CHEMBL229654
Type:
Small organic molecule
Emp. Form.:
C25H21N7O
Mol. Mass.:
435.4805
SMILES:
Cc1cccc(n1)-c1nc(CNc2ccc(cc2)C(N)=O)[nH]c1-c1ccc2nccnc2c1
: