Target
Glucocorticoid receptor
Ligand
BDBM50214943
Substrate
Meas. Tech.
ChEMBL_447642 (CHEMBL896649)
Ki
1.7±n/a nM
Citation
 Ardecky, RJHudson, ARPhillips, DPTyhonas, JSDeckhut, CLau, TLLi, YMartinborough, EARoach, SLHiguchi, RILopez, FJMarschke, KBMiner, JNKaranewsky, DSNegro-Vilar, AZhi, L 5(Z)-benzylidene-1,2-dihydro-9-hydroxy-10-methoxy-2,2,4-trimethyl-5H-1-aza-6-oxa-chrysenes as non-steroidal glucocorticoid receptor modulators. Bioorg Med Chem Lett 17:4158-62 (2007)  
Target
Name:
Glucocorticoid receptor
Synonyms:
GCR_HUMAN GRL Glucocorticoid receptor (GRFP) Nuclear receptor subfamily 3 group C member 1
Type:
Enzyme
Mol. Mass.:
85656.87
Organism:
Homo sapiens (Human)
Description:
P04150
Residue:
777
  
Inhibitor
Name:
BDBM50214943
Synonyms:
10-methoxy-2,2,4-trimethyl-5-[1-o-tolyl-meth-(Z)-ylidene]-2,4a,5,12a-tetrahydro-1H-6-oxa-1-aza-chrysen-9-ol | CHEMBL401433
Type:
Small organic molecule
Emp. Form.:
C28H29NO3
Mol. Mass.:
427.5348
SMILES:
COc1c(O)ccc2O\C(=C/c3ccccc3C)C3=C(C=CC4NC(C)(C)C=C(C)C34)c12
: