Target
Peroxisome proliferator-activated receptor delta
Ligand
BDBM50214964
Substrate
Meas. Tech.
ChEMBL_447651 (CHEMBL896658)
EC50
3900±n/a nM
Citation
 Havranek, MSauerberg, PMogensen, JPKratina, PJeppesen, CBPettersson, IPihera, P Novel selective PPARdelta agonists: optimization of activity by modification of alkynylallylic moiety. Bioorg Med Chem Lett 17:4144-9 (2007)  
Target
Name:
Peroxisome proliferator-activated receptor delta
Synonyms:
NR1C2 NUCI Nuclear receptor subfamily 1 group C member 2 PPAR-beta PPARD Peroxisome proliferator-activated receptor Peroxisome proliferator-activated receptor delta
Type:
Enzyme
Mol. Mass.:
49910.45
Organism:
Homo sapiens (Human)
Description:
Q03181
Residue:
441
  
Inhibitor
Name:
BDBM50214964
Synonyms:
(Z)-2-(2-methyl-4-(4-(4-(5-methylthiophen-2-yl)phenyl)-6-phenylhex-2-en-5-ynyloxy)phenoxy)acetic acid | CHEMBL234906
Type:
Small organic molecule
Emp. Form.:
C32H28O4S
Mol. Mass.:
508.627
SMILES:
Cc1ccc(s1)-c1ccc(cc1)C(\C=C/COc1ccc(OCC(O)=O)c(C)c1)C#Cc1ccccc1
: