Target
MAP kinase-activated protein kinase 3
Ligand
BDBM50215497
Substrate
Meas. Tech.
ChEMBL_456524 (CHEMBL922890)
IC50
160000±n/a nM
Citation
 Trujillo, JIMeyers, MJAnderson, DRHegde, SMahoney, MWVernier, WFBuchler, IPWu, KKYang, SYang, SHartmann, SJReitz, DB Novel tetrahydro-beta-carboline-1-carboxylic acids as inhibitors of mitogen activated protein kinase-activated protein kinase 2 (MK-2). Bioorg Med Chem Lett 17:4657-63 (2007)  
Target
Name:
MAP kinase-activated protein kinase 3
Synonyms:
3pK MAP kinase-activated protein kinase 3 (MAPKAP-K3) MAPK-activated protein kinase 3 MAPKAP kinase 3 MAPKAPK3
Type:
Serine/threonine-protein kinase
Mol. Mass.:
42991.57
Organism:
Homo sapiens (Human)
Description:
Recombinant MAPKAPK3 was phosphorylated by incubation with active p38alpha before assays.
Residue:
382
  
Inhibitor
Name:
BDBM50215497
Synonyms:
5-methoxy-9,12-diazatetracyclo[10.3.1.0^{2,10}.0^{3,8}]hexadeca-2(10),3,5,7-tetraene-11-carboxylic acid | CHEMBL394124
Type:
Small organic molecule
Emp. Form.:
C16H18N2O3
Mol. Mass.:
286.3257
SMILES:
COc1ccc2[nH]c3C(N4CCCC(C4)c3c2c1)C(O)=O
: