Target
5-hydroxytryptamine receptor 5A
Ligand
BDBM50215552
Substrate
Meas. Tech.
ChEMBL_439673 (CHEMBL887622)
Ki
>10000±n/a nM
Citation
 Siméon, FGBrown, AKZoghbi, SSPatterson, VMInnis, RBPike, VW Synthesis and simple 18F-labeling of 3-fluoro-5-(2-(2-(fluoromethyl)thiazol-4-yl)ethynyl)benzonitrile as a high affinity radioligand for imaging monkey brain metabotropic glutamate subtype-5 receptors with positron emission tomography. J Med Chem 50:3256-66 (2007)  
Target
Name:
5-hydroxytryptamine receptor 5A
Synonyms:
5-HT-5 5-hydroxytryptamine receptor 5 (5-HT5) 5HT5A_HUMAN Serotonin (5-HT) receptor | Serotonin receptor 5A
Type:
Enzyme
Mol. Mass.:
40266.25
Organism:
Homo sapiens (Human)
Description:
P47898
Residue:
357
  
Inhibitor
Name:
BDBM50215552
Synonyms:
3-fluoro-5-(2-(2-(fluoromethyl)thiazol-4-yl)ethynyl)benzonitrile | CHEMBL229429
Type:
Small organic molecule
Emp. Form.:
C13H6F2N2S
Mol. Mass.:
260.262
SMILES:
FCc1nc(cs1)C#Cc1cc(F)cc(c1)C#N
: