Target
5-hydroxytryptamine receptor 7
Ligand
BDBM50215552
Substrate
Meas. Tech.
ChEMBL_439675 (CHEMBL887624)
Ki
>10000±n/a nM
Citation
 Siméon, FGBrown, AKZoghbi, SSPatterson, VMInnis, RBPike, VW Synthesis and simple 18F-labeling of 3-fluoro-5-(2-(2-(fluoromethyl)thiazol-4-yl)ethynyl)benzonitrile as a high affinity radioligand for imaging monkey brain metabotropic glutamate subtype-5 receptors with positron emission tomography. J Med Chem 50:3256-66 (2007)  
Target
Name:
5-hydroxytryptamine receptor 7
Synonyms:
5-HT-7 5-HT7 5-HT7S 5HT7 HTR7 | Serotonin receptor 7
Type:
G Protein-Coupled Receptor (GPCR)
Mol. Mass.:
53573.08
Organism:
Homo sapiens (Human)
Description:
P34969
Residue:
479
  
Inhibitor
Name:
BDBM50215552
Synonyms:
3-fluoro-5-(2-(2-(fluoromethyl)thiazol-4-yl)ethynyl)benzonitrile | CHEMBL229429
Type:
Small organic molecule
Emp. Form.:
C13H6F2N2S
Mol. Mass.:
260.262
SMILES:
FCc1nc(cs1)C#Cc1cc(F)cc(c1)C#N
: