Target
Melanin-concentrating hormone receptor 1
Ligand
BDBM50215596
Substrate
Meas. Tech.
ChEMBL_437192 (CHEMBL906590)
Ki
4.2±n/a nM
Citation
 Su, JMcKittrick, BATang, HBurnett, DAClader, JWGreenlee, WJHawes, BEO'Neill, KSpar, BWeig, BKowalski, TSorota, SLi, CLiu, T SAR study of bicyclo[4.1.0]heptanes as melanin-concentrating hormone receptor R1 antagonists: taming hERG. Bioorg Med Chem 15:5369-85 (2007)  
Target
Name:
Melanin-concentrating hormone receptor 1
Synonyms:
G-protein coupled receptor 24 MCH receptor 1 MCH-R1 MCHR-1 MCHR1_HUMAN Melanin-Concentrating Hormone Receptor 1 (MCH1R) Melanin-concentrating hormone receptor 1 (MCH-1) Melanin-concentrating hormone receptor 1 (MCHR-1) SLC-1 Somatostatin receptor-like protein
Type:
G Protein-Coupled Receptor (GPCR)
Mol. Mass.:
45976.27
Organism:
Homo sapiens (Human)
Description:
Membranes from CHO-K1 cells stably expressing human MCH1R were used in assays.
Residue:
422
  
Inhibitor
Name:
BDBM50215596
Synonyms:
3-(3-chloro-4-fluorophenyl)-1-(4-(5-cyanothiophen-2-yl)cyclohex-3-enyl)-1-(2-(pyrrolidin-1-yl)ethyl)urea | CHEMBL229461
Type:
Small organic molecule
Emp. Form.:
C24H26ClFN4OS
Mol. Mass.:
473.006
SMILES:
Fc1ccc(NC(=O)N(CCN2CCCC2)C2CCC(=CC2)c2ccc(s2)C#N)cc1Cl
: