Target
P2X purinoceptor 7
Ligand
BDBM50216385
Substrate
Meas. Tech.
ChEMBL_440099 (CHEMBL890410)
IC50
>1000±n/a nM
Citation
 Romagnoli, RBaraldi, PGCarrion, MDCara, CLPreti, DCruz-Lopez, OTabrizi, MAMoorman, ARGessi, SFogli, ESacchetto, VBorea, PA From tyrosine to glycine: synthesis and biological activity of potent antagonists of the purinergic P2X7 receptor. J Med Chem 50:3706-15 (2007)  
Target
Name:
P2X purinoceptor 7
Synonyms:
ATP receptor P2RX7_HUMAN P2X purinoceptor 7 (P2X7) P2Z receptor | Purinergic receptor
Type:
Protein
Mol. Mass.:
68602.85
Organism:
Homo sapiens (Human)
Description:
Q99572
Residue:
595
  
Inhibitor
Name:
BDBM50216385
Synonyms:
CHEMBL230926 | naphthalenesulfon-1-yl-{2-[4-(4-fluorophenyl)piperazin-1-yl]-2-oxoethyl}amide
Type:
Small organic molecule
Emp. Form.:
C23H24FN3O3S
Mol. Mass.:
441.518
SMILES:
Fc1ccc(cc1)N1CCN(CC1)C(=O)CCNS(=O)(=O)c1cccc2ccccc12
: