Target
Caspase-3
Ligand
BDBM50216421
Substrate
Meas. Tech.
ChEMBL_440102 (CHEMBL890414)
IC50
3.9±n/a nM
Citation
 Chu, WRothfuss, Jd'Avignon, AZeng, CZhou, DHotchkiss, RSMach, RH Isatin sulfonamide analogs containing a Michael addition acceptor: a new class of caspase 3/7 inhibitors. J Med Chem 50:3751-5 (2007)  
Target
Name:
Caspase-3
Synonyms:
Apopain CASP3 CPP-32 Caspase 3 Caspase-3 subunit p17 SCA-1 Yama protein | caspase-3 preproprotein
Type:
Hydrolase; heterotetramer of two heterodimers
Mol. Mass.:
31607.55
Organism:
Homo sapiens (Human)
Description:
Residue:
277
  
Inhibitor
Name:
BDBM50216421
Synonyms:
1-(4-hydroxy-benzyl)-5-[2-(pyridin-3-yl-oxymethyl)-pyrrolidine-1-sulfonyl]-1H-indole-2,3-dione | CHEMBL227035
Type:
Small organic molecule
Emp. Form.:
C25H23N3O6S
Mol. Mass.:
493.532
SMILES:
Oc1ccc(CN2C(=O)C(=O)c3cc(ccc23)S(=O)(=O)N2CCC[C@H]2COc2cccnc2)cc1
: