Target
Caspase-6
Ligand
BDBM50216423
Substrate
Meas. Tech.
ChEMBL_440103 (CHEMBL890415)
IC50
407±n/a nM
Citation
 Chu, WRothfuss, Jd'Avignon, AZeng, CZhou, DHotchkiss, RSMach, RH Isatin sulfonamide analogs containing a Michael addition acceptor: a new class of caspase 3/7 inhibitors. J Med Chem 50:3751-5 (2007)  
Target
Name:
Caspase-6
Synonyms:
Apoptotic protease Mch-2 CASP6 Caspase | MCH2
Type:
Enzyme
Mol. Mass.:
33312.62
Organism:
Homo sapiens (Human)
Description:
P55212
Residue:
293
  
Inhibitor
Name:
BDBM50216423
Synonyms:
2-[2-oxo-5-(2-phenoxymethyl-pyrrolidine-1-sulfonyl)-1,2-dihydro-indol-3-yl-idene]-malononitrile | CHEMBL376760
Type:
Small organic molecule
Emp. Form.:
C22H18N4O4S
Mol. Mass.:
434.468
SMILES:
O=[#6]1-[#7]-c2ccc(cc2\[#6]-1=[#6](\C#N)C#N)S(=O)(=O)[#7]-1-[#6]-[#6]-[#6]-[#6@H]-1-[#6]-[#8]-c1ccccc1
: