Target
Caspase-3
Ligand
BDBM50216418
Substrate
Meas. Tech.
ChEMBL_440102 (CHEMBL890414)
IC50
5.1±n/a nM
Citation
 Chu, WRothfuss, Jd'Avignon, AZeng, CZhou, DHotchkiss, RSMach, RH Isatin sulfonamide analogs containing a Michael addition acceptor: a new class of caspase 3/7 inhibitors. J Med Chem 50:3751-5 (2007)  
Target
Name:
Caspase-3
Synonyms:
Apopain CASP3 CPP-32 Caspase 3 Caspase-3 subunit p17 SCA-1 Yama protein | caspase-3 preproprotein
Type:
Hydrolase; heterotetramer of two heterodimers
Mol. Mass.:
31607.55
Organism:
Homo sapiens (Human)
Description:
Residue:
277
  
Inhibitor
Name:
BDBM50216418
Synonyms:
2-{1-(4-bromo-benzyl)-2-oxo-5-[2-(pyridine-3-yloxymethyl)-pyrrolidine-1-sulfonyl]-1,2-dihydro-indol-3-yl-idene}-malononitrile | CHEMBL387556
Type:
Small organic molecule
Emp. Form.:
C28H22BrN5O4S
Mol. Mass.:
604.474
SMILES:
Brc1ccc(-[#6]-[#7]-2-[#6](=O)\[#6](=[#6](\C#N)C#N)-c3cc(ccc-23)S(=O)(=O)[#7]-2-[#6]-[#6]-[#6]-[#6@H]-2-[#6]-[#8]-c2cccnc2)cc1
: