Target
Metabotropic glutamate receptor 5
Ligand
BDBM50216749
Substrate
Meas. Tech.
ChEMBL_447843 (CHEMBL898093)
IC50
2±n/a nM
Citation
 Milbank, JBKnauer, CSAugelli-Szafran, CESakkab-Tan, ATLin, KKYamagata, KHoffman, JKZhuang, NThomas, JGalatsis, PWendt, JAMickelson, JWSchwarz, RDKinsora, JJLotarski, SMStakich, KGillespie, KKLam, WWMutlib, AE Rational design of 7-arylquinolines as non-competitive metabotropic glutamate receptor subtype 5 antagonists. Bioorg Med Chem Lett 17:4415-8 (2007)  
Target
Name:
Metabotropic glutamate receptor 5
Synonyms:
GRM5_RAT Grm5 Mglur5 metabotropic glutamate 5/1-C metabotropic glutamate 5a
Type:
Enzyme
Mol. Mass.:
131900.14
Organism:
Rattus norvegicus (Rat)
Description:
P31424
Residue:
1203
  
Inhibitor
Name:
BDBM50216749
Synonyms:
3-(methoxymethyl)-5-(2-methylquinolin-7-yl)benzonitrile | CHEMBL231790
Type:
Small organic molecule
Emp. Form.:
C19H16N2O
Mol. Mass.:
288.3431
SMILES:
COCc1cc(cc(c1)-c1ccc2ccc(C)nc2c1)C#N
: