Target
Thymidine kinase
Ligand
BDBM50217810
Substrate
Meas. Tech.
ChEMBL_444706 (CHEMBL894947)
IC50
24000±n/a nM
Citation
 Robins, MJNowak, IRajwanshi, VKMiranda, KCannon, JFPeterson, MAAndrei, GSnoeck, RDe Clercq, EBalzarini, J Synthesis and antiviral evaluation of 6-(alkyl-heteroaryl)furo[2,3-d]pyrimidin-2(3H)-one nucleosides and analogues with ethynyl, ethenyl, and ethyl spacers at C6 of the furopyrimidine core. J Med Chem 50:3897-905 (2007)  
Target
Name:
Thymidine kinase
Synonyms:
KITH_VZVD | TK
Type:
PROTEIN
Mol. Mass.:
37819.99
Organism:
Varicella-zoster virus (strain Dumas) (HHV-3) (Human herpesvirus 3)
Description:
ChEMBL_444706
Residue:
341
  
Inhibitor
Name:
BDBM50217810
Synonyms:
3-(2-deoxy-beta-D-erythro-pentofuranosyl)-6-(5-pentylpyrimid-2-yl)furo[2,3-d]pyrimidin-2(3H)-one | CHEMBL245043
Type:
Small organic molecule
Emp. Form.:
C20H24N4O5
Mol. Mass.:
400.4284
SMILES:
CCCCCc1cnc(nc1)-c1cc2cn([C@H]3C[C@H](O)[C@@H](CO)O3)c(=O)nc2o1
: