Target
5-hydroxytryptamine receptor 6
Ligand
BDBM50217920
Substrate
Meas. Tech.
ChEMBL_448716 (CHEMBL897862)
Ki
1.3±n/a nM
Citation
 Elokdah, HLi, DMcFarlane, GBernotas, RCRobichaud, AJMagolda, RLZhang, GMSmith, DSchechter, LE Novel 1-(azacyclyl)-3-arylsulfonyl-1H-pyrrolo[2,3-b]pyridines as 5-HT6 agonists and antagonists. Bioorg Med Chem 15:6208-26 (2007)  
Target
Name:
5-hydroxytryptamine receptor 6
Synonyms:
5-HT-6 5-hydroxytryptamine receptor 6 (5-HT-6) 5-hydroxytryptamine receptor 6 (5HT6) HTR6 Serotonin 6 (5-HT6) receptor | Serotonin Receptor 6
Type:
G Protein-Coupled Receptor (GPCR)
Mol. Mass.:
46968.43
Organism:
Homo sapiens (Human)
Description:
P50406
Residue:
440
  
Inhibitor
Name:
BDBM50217920
Synonyms:
3-(3-bromo-benzenesulfonyl)-1-pyrrolidin-3-yl-1Hpyrrolo[2,3-b]pyridine | CHEMBL236404
Type:
Small organic molecule
Emp. Form.:
C17H16BrN3O2S
Mol. Mass.:
406.297
SMILES:
Brc1cccc(c1)S(=O)(=O)c1cn(C2CCNC2)c2ncccc12
: