Target
Alpha-2B adrenergic receptor
Ligand
BDBM50412250
Substrate
Meas. Tech.
ChEMBL_444830 (CHEMBL895081)
EC50
646±n/a nM
Citation
 Crassous, PACardinaletti, CCarrieri, ABruni, BDi Vaira, MGentili, FGhelfi, FGiannella, MParis, HPiergentili, AQuaglia, WSchaak, SVesprini, CPigini, M Alpha2-adrenoreceptors profile modulation. 3.1 (R)-(+)-m-nitrobiphenyline, a new efficient and alpha2C-subtype selective agonist. J Med Chem 50:3964-8 (2007)  
Target
Name:
Alpha-2B adrenergic receptor
Synonyms:
ADA2B_HUMAN ADRA2L1 Adrenergic alpha2B Adrenergic receptor alpha Alpha-2 adrenergic receptor subtype C2 Alpha-2B adrenoreceptor | Alpha-2BAR
Type:
Enzyme
Mol. Mass.:
49964.20
Organism:
Homo sapiens (Human)
Description:
P18089
Residue:
450
  
Inhibitor
Name:
BDBM50412250
Synonyms:
CHEMBL128168
Type:
Small organic molecule
Emp. Form.:
C17H18N2O
Mol. Mass.:
266.3376
SMILES:
CC(Oc1ccccc1-c1ccccc1)C1=NCCN1
: