Target
Alpha-2C adrenergic receptor
Ligand
BDBM50002905
Substrate
Meas. Tech.
ChEMBL_444831 (CHEMBL895082)
EC50
50±n/a nM
Citation
 Crassous, PACardinaletti, CCarrieri, ABruni, BDi Vaira, MGentili, FGhelfi, FGiannella, MParis, HPiergentili, AQuaglia, WSchaak, SVesprini, CPigini, M Alpha2-adrenoreceptors profile modulation. 3.1 (R)-(+)-m-nitrobiphenyline, a new efficient and alpha2C-subtype selective agonist. J Med Chem 50:3964-8 (2007)  
Target
Name:
Alpha-2C adrenergic receptor
Synonyms:
ADA2C_HUMAN ADRA2L2 Adrenergic alpha2C Adrenergic receptor alpha Alpha-2 adrenergic receptor subtype C4 Alpha-2C adrenoreceptor | adrenergic, alpha-2C-, receptor [Homo sapiens]
Type:
Enzyme
Mol. Mass.:
49552.32
Organism:
Homo sapiens (Human)
Description:
P18825
Residue:
462
  
Inhibitor
Name:
BDBM50002905
Synonyms:
CHEMBL373535
Type:
Small organic molecule
Emp. Form.:
C16H17N3O
Mol. Mass.:
267.3257
SMILES:
CC(Oc1ccccc1-c1cccnc1)C1=NCCN1
: