Target
Serine/threonine-protein kinase pim-1
Ligand
BDBM7462
Substrate
Meas. Tech.
ChEMBL_459174 (CHEMBL926333)
IC50
1288±n/a nM
Citation
 Holder, SLilly, MBrown, ML Comparative molecular field analysis of flavonoid inhibitors of the PIM-1 kinase. Bioorg Med Chem 15:6463-73 (2007)  
Target
Name:
Serine/threonine-protein kinase pim-1
Synonyms:
PIM-1 Kinase PIM1_HUMAN Serine/threonine-protein kinase (PIM1) Serine/threonine-protein kinase PIM1 | Serine/threonine-protein kinase pim-1 (PIM1)
Type:
Protein
Mol. Mass.:
35681.82
Organism:
Homo sapiens (Human)
Description:
P11309
Residue:
313
  
Inhibitor
Name:
BDBM7462
Synonyms:
3,5,7-trihydroxy-2-(4-hydroxyphenyl)-4H-chromen-4-one CHEMBL150 Kaempferol (Kmp) kaempferol
Type:
Small organic molecule
Emp. Form.:
C15H10O6
Mol. Mass.:
286.2363
SMILES:
Oc1ccc(cc1)-c1oc2cc(O)cc(O)c2c(=O)c1O
: