Target
Coagulation factor X
Ligand
BDBM50218307
Substrate
Meas. Tech.
ChEMBL_448736 (CHEMBL897883)
Ki
2.2±n/a nM
Citation
 Qiao, JXWang, TCWang, GZCheney, DLHe, KRendina, ARXin, BLuettgen, JMKnabb, RMWexler, RRLam, PY Enantiopure five-membered cyclicdiamine derivatives as potent and selective inhibitors of factor Xa. Improving in vitro metabolic stability via core modifications. Bioorg Med Chem Lett 17:5041-8 (2007)  
Target
Name:
Coagulation factor X
Synonyms:
Activated coagulation factor X (FXa) Coagulation factor X precursor F10 Factor X heavy chain Factor Xa Stuart-Prower factor
Type:
Enzyme
Mol. Mass.:
54726.60
Organism:
Homo sapiens (Human)
Description:
Residue:
488
  
Inhibitor
Name:
BDBM50218307
Synonyms:
CHEMBL235150 | N-((3R,4S)-1-benzoyl-4-(4-(2-oxopyridin-1(2H)-yl)benzamido)pyrrolidin-3-yl)-5-chlorothiophene-2-carboxamide
Type:
Small organic molecule
Emp. Form.:
C28H23ClN4O4S
Mol. Mass.:
547.025
SMILES:
Clc1ccc(s1)C(=O)N[C@@H]1CN(C[C@@H]1NC(=O)c1ccc(cc1)-n1ccccc1=O)C(=O)c1ccccc1
: