Target
Coagulation factor XI
Ligand
BDBM50218283
Substrate
Meas. Tech.
ChEMBL_448739 (CHEMBL897887)
Ki
6680±n/a nM
Citation
 Qiao, JXWang, TCWang, GZCheney, DLHe, KRendina, ARXin, BLuettgen, JMKnabb, RMWexler, RRLam, PY Enantiopure five-membered cyclicdiamine derivatives as potent and selective inhibitors of factor Xa. Improving in vitro metabolic stability via core modifications. Bioorg Med Chem Lett 17:5041-8 (2007)  
Target
Name:
Coagulation factor XI
Synonyms:
Coagulation factor XIa Coagulation factor XIa light chain FA11_HUMAN Factor XIa PTA | Plasma thromboplastin antecedent
Type:
Enzyme
Mol. Mass.:
70130.58
Organism:
Homo sapiens (Human)
Description:
P03951
Residue:
625
  
Inhibitor
Name:
BDBM50218283
Synonyms:
5-chloro-N-((3R,4S)-1-(ethylsulfonyl)-4-(4-(2-oxopyridin-1(2H)-yl)benzamido)pyrrolidin-3-yl)thiophene-2-carboxamide | CHEMBL392297
Type:
Small organic molecule
Emp. Form.:
C23H23ClN4O5S2
Mol. Mass.:
535.036
SMILES:
CCS(=O)(=O)N1C[C@@H](NC(=O)c2ccc(Cl)s2)[C@H](C1)NC(=O)c1ccc(cc1)-n1ccccc1=O
: