Target
Cholinesterase
Ligand
BDBM50218514
Substrate
Meas. Tech.
ChEMBL_444936 (CHEMBL894086)
IC50
>0.000±n/a nM
Comments
modified from >0.000010
Citation
 Piazzi, LCavalli, ABelluti, FBisi, AGobbi, SRizzo, SBartolini, MAndrisano, VRecanatini, MRampa, A Extensive SAR and computational studies of 3-{4-[(benzylmethylamino)methyl]phenyl}-6,7-dimethoxy-2H-2-chromenone (AP2238) derivatives. J Med Chem 50:4250-4 (2007)  
Target
Name:
Cholinesterase
Synonyms:
Acylcholine acylhydrolase Butyrylcholine esterase (BChE) Butyrylcholinesterase (BuChE) CHLE_HUMAN Cholinesterases Pseudocholinesterase
Type:
Homotetramer
Mol. Mass.:
68422.27
Organism:
Homo sapiens (Human)
Description:
P06276
Residue:
602
  
Inhibitor
Name:
BDBM50218514
Synonyms:
2-{4-[(benzylmethylamino)methyl]phenyl}-7-methoxychromen-4-one | CHEMBL241830
Type:
Small organic molecule
Emp. Form.:
C25H23NO3
Mol. Mass.:
385.455
SMILES:
COc1ccc2c(c1)oc(cc2=O)-c1ccc(CN(C)Cc2ccccc2)cc1
: