Target
Aurora kinase B
Ligand
BDBM50218900
Substrate
Meas. Tech.
ChEMBL_445190 (CHEMBL894338)
IC50
8000±n/a nM
Citation
 Myrianthopoulos, VMagiatis, PFerandin, YSkaltsounis, ALMeijer, LMikros, E An integrated computational approach to the phenomenon of potent and selective inhibition of aurora kinases B and C by a series of 7-substituted indirubins. J Med Chem 50:4027-37 (2007)  
Target
Name:
Aurora kinase B
Synonyms:
AIK2 AIM1 ARK2 AURKB_HUMAN Aurora B-INCENP Aurora kinase B (AURKB) STK-1 STK12 Serine/threonine-protein kinase aurora B
Type:
Protein
Mol. Mass.:
39327.72
Organism:
Homo sapiens (Human)
Description:
Q96GD4
Residue:
344
  
Inhibitor
Name:
BDBM50218900
Synonyms:
7-fluoroindirubin-3-acetoxime | CHEMBL243985
Type:
Small organic molecule
Emp. Form.:
C18H12FN3O3
Mol. Mass.:
337.3046
SMILES:
CC(=O)ON=C1C(Nc2ccccc12)=C1C(=O)Nc2c1cccc2F
: