Target
Aurora kinase A
Ligand
BDBM50191445
Substrate
Meas. Tech.
ChEMBL_445189 (CHEMBL894337)
IC50
>100000±n/a nM
Citation
 Myrianthopoulos, VMagiatis, PFerandin, YSkaltsounis, ALMeijer, LMikros, E An integrated computational approach to the phenomenon of potent and selective inhibition of aurora kinases B and C by a series of 7-substituted indirubins. J Med Chem 50:4027-37 (2007)  
Target
Name:
Aurora kinase A
Synonyms:
AIK ARK1 AURKA AYK1 Aurora kinase A (AURA) Aurora kinase A (Aurora A) Aurora-related kinase 1 BTAK Breast-tumor-amplified kinase STK15 Serine/threonine kinase 15 Serine/threonine-protein kinase aurora A hARK1
Type:
Serine/threonine-protein kinase
Mol. Mass.:
45830.98
Organism:
Homo sapiens (Human)
Description:
O14965
Residue:
403
  
Inhibitor
Name:
BDBM50191445
Synonyms:
(2'Z)-7-chloroindirubin | CHEMBL378191
Type:
Small organic molecule
Emp. Form.:
C16H9ClN2O2
Mol. Mass.:
296.708
SMILES:
Oc1[nH]c2c(Cl)cccc2c1C1=Nc2ccccc2C1=O
: