Target
Aurora kinase C
Ligand
BDBM50218887
Substrate
Meas. Tech.
ChEMBL_445191 (CHEMBL894339)
IC50
>100000±n/a nM
Citation
 Myrianthopoulos, VMagiatis, PFerandin, YSkaltsounis, ALMeijer, LMikros, E An integrated computational approach to the phenomenon of potent and selective inhibition of aurora kinases B and C by a series of 7-substituted indirubins. J Med Chem 50:4027-37 (2007)  
Target
Name:
Aurora kinase C
Synonyms:
AIE2 AIRK3 AURKC Aurora Kinase C (Aurora-C) Aurora kinase C (AURKC) Aurora-C/INCENP Aurora/Ipl1/Eg2 protein 2 Serine/threonine-protein kinase 13 | Serine/threonine-protein kinase Aurora-C
Type:
Enzyme
Mol. Mass.:
35602.43
Organism:
Homo sapiens (Human)
Description:
Amino acid residues 1-309 were expressed as His-tagged fusion protein using baculovirus expression system.
Residue:
309
  
Inhibitor
Name:
BDBM50218887
Synonyms:
7-chloroindirubin-3-methoxime | CHEMBL243776
Type:
Small organic molecule
Emp. Form.:
C17H12ClN3O2
Mol. Mass.:
325.749
SMILES:
CO\N=C1/C(/Nc2ccccc/12)=C1/C(=O)Nc2c1cccc2Cl
: