Target
Adenosine receptor A3
Ligand
BDBM50218908
Substrate
Meas. Tech.
ChEMBL_445192 (CHEMBL894340)
Ki
101.5±n/a nM
Citation
 Colotta, VCatarzi, DVarano, FCapelli, FLenzi, OFilacchioni, GMartini, CTrincavelli, LCiampi, OPugliese, AMPedata, FSchiesaro, AMorizzo, EMoro, S New 2-arylpyrazolo[3,4-c]quinoline derivatives as potent and selective human A3 adenosine receptor antagonists. Synthesis, pharmacological evaluation, and ligand-receptor modeling studies. J Med Chem 50:4061-74 (2007)  
Target
Name:
Adenosine receptor A3
Synonyms:
A3 adenosine receptor (hA3) ADORA3 | Adenosine A3 receptor (A3AR)
Type:
G Protein-Coupled Receptor (GPCR)
Mol. Mass.:
36197.32
Organism:
Homo sapiens (Human)
Description:
P0DMS8
Residue:
318
  
Inhibitor
Name:
BDBM50218908
Synonyms:
CHEMBL242422 | N-(2-(4-methoxyphenyl)-2H-pyrazolo[3,4-c]quinolin-4-yl)acetamide
Type:
Small organic molecule
Emp. Form.:
C19H16N4O2
Mol. Mass.:
332.3559
SMILES:
COc1ccc(cc1)-n1cc2c(n1)c(NC(C)=O)nc1ccccc21
: