Target
Tyrosine-protein phosphatase non-receptor type 2
Ligand
BDBM50219577
Substrate
Meas. Tech.
ChEMBL_445833 (CHEMBL896127)
Ki
2±n/a nM
Citation
 Wilson, DPWan, ZKXu, WXKirincich, SJFollows, BCJoseph-McCarthy, DForeman, KMoretto, AWu, JZhu, MBinnun, EZhang, YLTam, MErbe, DVTobin, JXu, XLeung, LShilling, ATam, SYMansour, TSLee, J Structure-based optimization of protein tyrosine phosphatase 1B inhibitors: from the active site to the second phosphotyrosine binding site. J Med Chem 50:4681-98 (2007)  
Target
Name:
Tyrosine-protein phosphatase non-receptor type 2
Synonyms:
PTN2_HUMAN PTPT T-cell protein-tyrosine phosphatase TCPTP Tyrosine-protein phosphatase non-receptor type 2 (TC-PTP)
Type:
Protein
Mol. Mass.:
48481.80
Organism:
Homo sapiens (Human)
Description:
P17706
Residue:
415
  
Inhibitor
Name:
BDBM50219577
Synonyms:
5-[3-({1-[(2-aminobenzyl)sulfonyl]piperidin-4-yl}amino)-phenyl]-4-bromo-3-(carboxymethoxy)thiophene-2-carboxylic acid | CHEMBL230860
Type:
Small organic molecule
Emp. Form.:
C25H26BrN3O7S2
Mol. Mass.:
624.524
SMILES:
Nc1ccccc1CS(=O)(=O)N1CCC(CC1)Nc1cccc(c1)-c1sc(C(O)=O)c(OCC(O)=O)c1Br
: