Target
Receptor-type tyrosine-protein phosphatase C
Ligand
BDBM50219573
Substrate
Meas. Tech.
ChEMBL_445834 (CHEMBL896128)
Ki
151000±n/a nM
Citation
 Wilson, DPWan, ZKXu, WXKirincich, SJFollows, BCJoseph-McCarthy, DForeman, KMoretto, AWu, JZhu, MBinnun, EZhang, YLTam, MErbe, DVTobin, JXu, XLeung, LShilling, ATam, SYMansour, TSLee, J Structure-based optimization of protein tyrosine phosphatase 1B inhibitors: from the active site to the second phosphotyrosine binding site. J Med Chem 50:4681-98 (2007)  
Target
Name:
Receptor-type tyrosine-protein phosphatase C
Synonyms:
CD45 L-CA PTPRC Receptor-type tyrosine-protein phosphatase C (CD45) | T200
Type:
Protein
Mol. Mass.:
147474.19
Organism:
Homo sapiens (Human)
Description:
P08575
Residue:
1306
  
Inhibitor
Name:
BDBM50219573
Synonyms:
4-BROMO-3-(CARBOXYMETHOXY)-5-{3-[(3,3,5,5-TETRAMETHYLCYCLOHEXYL)AMINO]PHENYL}THIOPHENE-2-CARBOXYLIC ACID 4-bromo-3-carboxymethoxy-5-[3-(3,3,5,5-tetramethylcyclohexylamino)phenyl]thiophene-2-carboxylic acid | CHEMBL243942
Type:
Small organic molecule
Emp. Form.:
C23H28BrNO5S
Mol. Mass.:
510.441
SMILES:
CC1(C)CC(CC(C)(C)C1)Nc1cccc(c1)-c1sc(C(O)=O)c(OCC(O)=O)c1Br
: