Target
Thrombopoietin receptor
Ligand
BDBM50219609
Substrate
Meas. Tech.
ChEMBL_457234 (CHEMBL941720)
EC50
220±n/a nM
Citation
 Reiter, LASubramanyam, CMangual, EJJones, CSSmeets, MIBrissette, WHMcCurdy, SPLira, PDLinde, RGLi, QZhang, FAntipas, ASBlumberg, LCDoty, JLDriscoll, JPMunchhof, MJRipp, SLShavnya, AShepard, RMSperger, DThomasco, LMTrevena, KAWolf-Gouveia, LAZhang, L Pyrimidine benzamide-based thrombopoietin receptor agonists. Bioorg Med Chem Lett 17:5447-54 (2007)  
Target
Name:
Thrombopoietin receptor
Synonyms:
C-mpl MPL TPO-R TPOR_HUMAN
Type:
PROTEIN
Mol. Mass.:
71243.48
Organism:
Homo sapiens (Human)
Description:
ChEMBL_535587
Residue:
635
  
Inhibitor
Name:
BDBM50219609
Synonyms:
CHEMBL248434 | N-(3-(4-fluoro-3-(trifluoromethyl)phenyl)-1,2,4-thiadiazol-5-yl)-4-(6-((2-hydroxyethyl)(methyl)amino)pyrimidin-4-ylamino)benzamide
Type:
Small organic molecule
Emp. Form.:
C23H19F4N7O2S
Mol. Mass.:
533.501
SMILES:
CN(CCO)c1cc(Nc2ccc(cc2)C(=O)Nc2nc(ns2)-c2ccc(F)c(c2)C(F)(F)F)ncn1
: