Target
Mu-type opioid receptor
Ligand
BDBM50219919
Substrate
Meas. Tech.
ChEMBL_449057 (CHEMBL899315)
Ki
0.070000±n/a nM
Citation
 Takeuchi, KHolloway, WGMcKinzie, JHSuter, TMStatnick, MASurface, PLEmmerson, PJThomas, EMSiegel, MGMatt, JEWolfe, CNMitch, CH Structure-activity relationship studies of carboxamido-biaryl ethers as opioid receptor antagonists (OpRAs). Part 1. Bioorg Med Chem Lett 17:5349-52 (2007)  
Target
Name:
Mu-type opioid receptor
Synonyms:
M-OR-1 MOR-1 MUOR1 Mu opiate receptor OPRM1 hMOP | mu-type opioid receptor isoform MOR-1
Type:
G Protein-Coupled Receptor (GPCR)
Mol. Mass.:
44789.51
Organism:
Homo sapiens (Human)
Description:
P35372
Residue:
400
  
Inhibitor
Name:
BDBM50219919
Synonyms:
6-(4-((phenethylamino)methyl)phenoxy)nicotinamide | CHEMBL238361
Type:
Small organic molecule
Emp. Form.:
C21H21N3O2
Mol. Mass.:
347.4103
SMILES:
NC(=O)c1ccc(Oc2ccc(CNCCc3ccccc3)cc2)nc1
: