Target
Beta-secretase 1
Ligand
BDBM50220305
Substrate
Meas. Tech.
ChEMBL_449199 (CHEMBL899464)
IC50
140±n/a nM
Citation
 Fobare, WFSolvibile, WRRobichaud, AJMalamas, MSManas, ETurner, JHu, YWagner, EChopra, RCowling, RJin, GBard, J Thiophene substituted acylguanidines as BACE1 inhibitors. Bioorg Med Chem Lett 17:5353-6 (2007)  
Target
Name:
Beta-secretase 1
Synonyms:
ASP2 Aspartyl protease 2 BACE1 Beta-secretase (BACE) Beta-secretase 1 (BACE 1) Beta-secretase 1 (BACE1) Beta-site amyloid precursor protein cleaving enzyme 1 Memapsin-2 beta-Secretase (BACE-1) | beta-Secretase (BACE1)
Type:
Protein
Mol. Mass.:
55755.10
Organism:
Homo sapiens (Human)
Description:
P56817
Residue:
501
  
Inhibitor
Name:
BDBM50220305
Synonyms:
4-(3-(2-(amino(3-hydroxypropylamino)methyleneamino)-2-oxoethyl)-4-(2-chlorophenyl)thiophen-2-yl)-N-(cyclopropylmethyl)benzamide | CHEMBL237493
Type:
Small organic molecule
Emp. Form.:
C27H29ClN4O3S
Mol. Mass.:
525.062
SMILES:
OCCCNC(=N)NC(=O)Cc1c(csc1-c1ccc(cc1)C(=O)NCC1CC1)-c1ccccc1Cl
: