Target
Androgen receptor
Ligand
BDBM50220375
Substrate
Meas. Tech.
ChEMBL_449233 (CHEMBL899495)
IC50
146±n/a nM
Citation
 Van Camp, JAHu, LYKostlan, CLefker, BLi, JMitchell, LWang, ZYue, WSCarroll, MDettling, DDu, DPocalyko, DWade, K Preparation of 4-aryl-2-trifluoromethylbenzonitrile derivatives as androgen receptor antagonists for topical suppression of sebum production. Bioorg Med Chem Lett 17:5529-32 (2007)  
Target
Name:
Androgen receptor
Synonyms:
ANDR_HUMAN Androgen Receptor Androgen receptor/Baculoviral IAP repeat-containing protein 2 Dihydrotestosterone receptor Nuclear receptor subfamily 3 group C member 4
Type:
Receptor
Mol. Mass.:
99185.27
Organism:
Homo sapiens (Human)
Description:
CHO cells were stably transfected with human AR gene.
Residue:
920
  
Inhibitor
Name:
BDBM50220375
Synonyms:
2'-methyl-3-trifluoromethyl-biphenyl-4-carbonitrile | CHEMBL235379
Type:
Small organic molecule
Emp. Form.:
C15H10F3N
Mol. Mass.:
261.2418
SMILES:
Cc1ccccc1-c1ccc(C#N)c(c1)C(F)(F)F
: