Target
D(1A) dopamine receptor
Ligand
BDBM50012961
Substrate
Meas. Tech.
ChEMBL_457315 (CHEMBL941848)
Ki
12000±n/a nM
Citation
 Stark, DPiel, MHübner, HGmeiner, PGründer, GRösch, F In vitro affinities of various halogenated benzamide derivatives as potential radioligands for non-invasive quantification of D(2)-like dopamine receptors. Bioorg Med Chem 15:6819-29 (2007)  
Target
Name:
D(1A) dopamine receptor
Synonyms:
DRD1 Dopamine D1 receptor
Type:
PROTEIN
Mol. Mass.:
49269.92
Organism:
Sus scrofa
Description:
ChEMBL_1460140
Residue:
446
  
Inhibitor
Name:
BDBM50012961
Synonyms:
(-)-(S)-N-((1-ethylpyrrolidin-2-yl)methyl)-2-hydroxy-3-iodo-6-methoxybenzamide CHEMBL267723 N-(1-Ethyl-pyrrolidin-2-ylmethyl)-2-hydroxy-3-iodo-6-methoxy-benzamide N-(1-Ethyl-pyrrolidin-2-ylmethyl)-2-hydroxy-3-iodo-6-methoxy-benzamide( (S)-(-)IBZM)
Type:
Small organic molecule
Emp. Form.:
C15H21IN2O3
Mol. Mass.:
404.2433
SMILES:
CCN1CCC[C@H]1CNC(=O)c1c(O)c(I)ccc1OC
: