Target
Glutamate receptor ionotropic, NMDA 2B
Ligand
BDBM50220592
Substrate
Meas. Tech.
ChEMBL_457343 (CHEMBL940934)
Ki
5.6±n/a nM
Citation
 Kawai, MSakurada, IMorita, AIwamuro, YAndo, KOmura, HSakakibara, SMasuda, TKoike, HHonma, THattori, KTakashima, TMizuno, KMizutani, MKawamura, M Structure-activity relationship study of novel NR2B-selective antagonists with arylamides to avoid reactive metabolites formation. Bioorg Med Chem Lett 17:5537-42 (2007)  
Target
Name:
Glutamate receptor ionotropic, NMDA 2B
Synonyms:
GluN2B Grin2b NMDA receptor subunit N2B (GluN2B) NMDE2_RAT | NR2B
Type:
Protein
Mol. Mass.:
166077.66
Organism:
Rattus norvegicus (Rat)
Description:
Q00960
Residue:
1482
  
Inhibitor
Name:
BDBM50220592
Synonyms:
CHEMBL248875 | N-(3-phenethoxybenzyl)-4-hydroxybenzamide
Type:
Small organic molecule
Emp. Form.:
C22H21NO3
Mol. Mass.:
347.407
SMILES:
Oc1ccc(cc1)C(=O)NCc1cccc(OCCc2ccccc2)c1
: